Reaction Details
TargetProstaglandin E2 receptor EP2 subtype
LigandBDBM50101830
Substrate/Competitorn/a
Meas. Tech.ChEMBL_1364371 (CHEMBL3294240)
Ki 3.3±n/a nM
Citation Ganesh, T Prostanoid receptor EP2 as a therapeutic target. J Med Chem57:4454-65 (2014) 
 
Prostaglandin E2 receptor EP2 subtype
Name:Prostaglandin E2 receptor EP2 subtype
Type:Enzyme
Mol. Mass.:39775.71
Organism:Homo sapiens (Human)
Description:P43116
Residue:358
BDBM50101830
NameBDBM50101830
Synonyms:(Z)-7-{(1R,2R,3R,5R)-5-Chloro-2-[(E)-(S)-4-(1-ethyl-cyclobutyl)-4-hydroxy-but-1-enyl]-3-hydroxy-cyclopentyl}-hept-5-enoic acid | CHEMBL64246
TypeSmall organic molecule
Emp. Form.C22H35ClO4
Mol. Mass.398.964
SMILESCCC1(CCC1)[C@@H](O)C\C=C\[C@H]1[C@H](O)C[C@@H](Cl)[C@@H]1C\C=C/CCCC(O)=O