Reaction Details
TargetProstaglandin E2 receptor EP1 subtype
LigandBDBM85602
Substrate/Competitorn/a
Meas. Tech.ChEMBL_1364372 (CHEMBL3294241)
Ki>10000±n/a nM
Citation Ganesh, T Prostanoid receptor EP2 as a therapeutic target. J Med Chem57:4454-65 (2014) 
 
Prostaglandin E2 receptor EP1 subtype
Name:Prostaglandin E2 receptor EP1 subtype
Type:Enzyme
Mol. Mass.:41834.57
Organism:Homo sapiens (Human)
Description:P34995
Residue:402
BDBM85602
NameBDBM85602
Synonyms:(R)-BUTAPROST CAS_69648-38-0
TypeSmall organic molecule
Emp. Form.C24H40O5
Mol. Mass.408.5714
SMILESCCCC1(CCC1)[C@H](O)C\C=C\[C@H]1[C@H](O)CC(=O)[C@@H]1CCCCCCC(=O)OC