Reaction Details
TargetProtein kinase C epsilon type
LigandBDBM50017890
Substrate/Competitorn/a
Meas. Tech.ChEMBL_1364406 (CHEMBL3294518)
Ki 2.2±n/a nM
Citation Garcia, LCDonadío, LGMann, EKolusheva, SKedei, NLewin, NEHill, CSKelsey, JSYang, JEsch, TESantos, MPeach, MLKelley, JABlumberg, PMJelinek, RMarquez, VEComin, MJ Synthesis, biological, and biophysical studies of DAG-indololactones designed as selective activators of RasGRP. Bioorg Med Chem22:3123-40 (2014) 
 
Protein kinase C epsilon type
Name:Protein kinase C epsilon type
Type:Enzyme
Mol. Mass.:83680.45
Organism:Homo sapiens (Human)
Description:The recombinant human PKC enzymes were produced using a baculovirus expression system in SF9 cells
Residue:737
BDBM50017890
NameBDBM50017890
Synonyms:CHEMBL3289012
TypeSmall organic molecule
Emp. Form.C24H31NO5
Mol. Mass.413.5066
SMILESCCCC(CCC)C(=O)OCC1(CO)C\C(=C/c2ccc3n(C)ccc3c2)C(=O)O1