Reaction Details
TargetCoagulation factor X
LigandBDBM50017922
Substrate/Competitorn/a
Meas. Tech.ChEMBL_1364435 (CHEMBL3294776)
Ki 920±n/a nM
Citation Goswami, RMukherjee, SGhadiyaram, CWohlfahrt, GSistla, RKNagaraj, JSatyam, LKSubbarao, KPalakurthy, RKGopinath, SKrishnamurthy, NRIkonen, TMoilanen, ASubramanya, HSKallio, PRamachandra, M Structure-guided discovery of 1,3,5 tri-substituted benzenes as potent and selective matriptase inhibitors exhibiting in vivo antitumor efficacy. Bioorg Med Chem22:3187-203 (2014) 
 
Coagulation factor X
Name:Coagulation factor X
Type:PROTEIN
Mol. Mass.:54498.45
Organism:Bos taurus
Description:ChEMBL_1364435
Residue:492
BDBM50017922
NameBDBM50017922
Synonyms:CHEMBL3289025
TypeSmall organic molecule
Emp. Form.C28H31N5O4
Mol. Mass.501.5768
SMILESNC(=N)c1ccc(Oc2cc(Oc3ccc(cc3)C(N)=N)cc(c2)C(=O)NCC2CCC(O)CC2)cc1