Reaction Details
TargetD(4) dopamine receptor
LigandBDBM50017969
Substrate/Competitorn/a
Meas. Tech.ChEMBL_1365238 (CHEMBL3292988)
Ki 1.1±n/a nM
Citation Sampson, DZhu, XYEyunni, SVEtukala, JROfori, EBricker, BLamango, NSSetola, VRoth, BLAblordeppey, SY Identification of a new selective dopamine D4 receptor ligand. Bioorg Med Chem22:3105-14 (2014) 
 
D(4) dopamine receptor
Name:D(4) dopamine receptor
Type:Enzyme Catalytic Domain
Mol. Mass.:41307.65
Organism:RAT
Description:DOPAMINE D4.4 0 RAT::P30729
Residue:387
BDBM50017969
NameBDBM50017969
Synonyms:CHEMBL3289646
TypeSmall organic molecule
Emp. Form.C19H24FN3O
Mol. Mass.329.4118
SMILESCc1ccc(nc1)N1CCN(CCCOc2ccc(F)cc2)CC1