Reaction Details
Target5-hydroxytryptamine receptor 7
LigandBDBM50018223
Substrate/Competitorn/a
Meas. Tech.ChEMBL_1366807 (CHEMBL3297242)
Ki 1.3±n/a nM
Citation Kolaczkowski, MMarcinkowska, MBucki, APawlowski, MMitka, KJaskowska, JKowalski, PKazek, GSiwek, AWasik, AWesolowska, AMierzejewski, PBienkowski, P Novel arylsulfonamide derivatives with 5-HT6/5-HT7 receptor antagonism targeting behavioral and psychological symptoms of dementia. J Med Chem57:4543-57 (2014) 
 
5-hydroxytryptamine receptor 7
Name:5-hydroxytryptamine receptor 7
Type:G Protein-Coupled Receptor (GPCR)
Mol. Mass.:53573.08
Organism:Homo sapiens (Human)
Description:P34969
Residue:479
BDBM50018223
NameBDBM50018223
Synonyms:CHEMBL3290001
TypeSmall organic molecule
Emp. Form.C24H24FN3O3S
Mol. Mass.453.529
SMILESFc1ccc2c(noc2c1)C1CCN(CCNS(=O)(=O)c2cccc3ccccc23)CC1