Reaction Details
TargetAdenosylhomocysteinase
LigandBDBM50088426
Substrate/Competitorn/a
Meas. Tech.ChEMBL_1362082 (CHEMBL3294635)
IC50 303±n/a nM
Citation Converso, AHartingh, TFraley, MEGarbaccio, RMHartman, GDHuang, SYMajercak, JMMcCampbell, ANa, SJRay, WJSavage, MJWolffe, CYeh, SYu, YWhite, RZhang, R Adenosine analogue inhibitors of S-adenosylhomocysteine hydrolase. Bioorg Med Chem Lett24:2737-40 (2014) 
 
Adenosylhomocysteinase
Name:Adenosylhomocysteinase
Type:PROTEIN
Mol. Mass.:47714.06
Organism:Homo sapiens (Human)
Description:ChEMBL_1507791
Residue:432
BDBM50088426
NameBDBM50088426
Synonyms:(1R,2S,3R,5R)-3-(6-amino-9H-purin-9-yl)-5-(hydroxymethyl)cyclopentane-1,2-diol CHEMBL49935
TypeSmall organic molecule
Emp. Form.C11H15N5O3
Mol. Mass.265.2685
SMILESNc1ncnc2n(cnc12)[C@@H]1C[C@H](CO)[C@@H](O)[C@H]1O