Reaction Details
TargetAdenosylhomocysteinase
LigandBDBM50006218
Substrate/Competitorn/a
Meas. Tech.ChEMBL_1362082 (CHEMBL3294635)
IC50 55±n/a nM
Citation Converso, AHartingh, TFraley, MEGarbaccio, RMHartman, GDHuang, SYMajercak, JMMcCampbell, ANa, SJRay, WJSavage, MJWolffe, CYeh, SYu, YWhite, RZhang, R Adenosine analogue inhibitors of S-adenosylhomocysteine hydrolase. Bioorg Med Chem Lett24:2737-40 (2014) 
 
Adenosylhomocysteinase
Name:Adenosylhomocysteinase
Type:PROTEIN
Mol. Mass.:47714.06
Organism:Homo sapiens (Human)
Description:ChEMBL_1507791
Residue:432
BDBM50006218
NameBDBM50006218
Synonyms:(1R,2S,3R)-3-(6-amino-9H-purin-9-yl)cyclopentane-1,2-diol CHEMBL301499
TypeSmall organic molecule
Emp. Form.C10H13N5O2
Mol. Mass.235.2425
SMILESNc1ncnc2n(cnc12)[C@@H]1CC[C@@H](O)[C@H]1O