Reaction Details
TargetProstaglandin D2 receptor
LigandBDBM50302828
Substrate/Competitorn/a
Meas. Tech.ChEMBL_1364478 (CHEMBL3295026)
IC50 12±n/a nM
Citation Johnson, MGLiu, JJLi, ARvan Lengerich, BWang, SMedina, JCCollins, TLDanao, JSeitz, LWillee, AD'Souza, WBudelsky, ALFan, PWWong, SG Solving time-dependent CYP3A4 inhibition for a series of indole-phenylacetic acid dual antagonists of the PGD(2) receptors CRTH2 and DP. Bioorg Med Chem Lett24:2877-80 (2014) 
 
Prostaglandin D2 receptor
Name:Prostaglandin D2 receptor
Type:Enzyme
Mol. Mass.:40288.87
Organism:Homo sapiens (Human)
Description:Q13258
Residue:359
BDBM50302828
NameBDBM50302828
Synonyms:2-(4-(4-(butylcarbamoyl)-2-(2,4-dichlorophenylsulfonamido)phenoxy)-3-methoxyphenyl)acetic acid | CHEMBL589973
TypeSmall organic molecule
Emp. Form.C26H26Cl2N2O7S
Mol. Mass.581.465
SMILESCCCCNC(=O)c1ccc(Oc2ccc(CC(O)=O)cc2OC)c(NS(=O)(=O)c2ccc(Cl)cc2Cl)c1