Reaction Details
TargetNuclear receptor subfamily 1 group I member 2
LigandBDBM50018939
Substrate/Competitorn/a
Meas. Tech.ChEMBL_1364860 (CHEMBL3294823)
IC50 11000±n/a nM
Citation Hodnik, ?Peterlin Ma?ic, LToma?ic, TSmodi?, DD'Amore, CFiorucci, SKikelj, D Bazedoxifene-scaffold-based mimetics of solomonsterols A and B as novel pregnane X receptor antagonists. J Med Chem57:4819-33 (2014) 
 
Nuclear receptor subfamily 1 group I member 2
Name:Nuclear receptor subfamily 1 group I member 2
Type:Nuclear receptor
Mol. Mass.:49774.77
Organism:Homo sapiens (Human)
Description:O75469
Residue:434
BDBM50018939
NameBDBM50018939
Synonyms:CHEMBL3287132
TypeSmall organic molecule
Emp. Form.C15H13NO3
Mol. Mass.255.2686
SMILESCc1c([nH]c2ccc(O)cc12)-c1ccc(O)c(O)c1