Reaction Details
TargetNuclear receptor subfamily 1 group I member 2
LigandBDBM50018940
Substrate/Competitorn/a
Meas. Tech.ChEMBL_1364860 (CHEMBL3294823)
IC50 14000±n/a nM
Citation Hodnik, ?Peterlin Ma?ic, LToma?ic, TSmodi?, DD'Amore, CFiorucci, SKikelj, D Bazedoxifene-scaffold-based mimetics of solomonsterols A and B as novel pregnane X receptor antagonists. J Med Chem57:4819-33 (2014) 
 
Nuclear receptor subfamily 1 group I member 2
Name:Nuclear receptor subfamily 1 group I member 2
Type:Nuclear receptor
Mol. Mass.:49774.77
Organism:Homo sapiens (Human)
Description:O75469
Residue:434
BDBM50018940
NameBDBM50018940
Synonyms:CHEMBL3287136
TypeSmall organic molecule
Emp. Form.C18H19NO4
Mol. Mass.313.3478
SMILESCc1c([nH]c2ccc(OCCCO)cc12)-c1ccc(O)c(O)c1