Reaction Details
TargetCatechol O-methyltransferase
LigandBDBM50019332
Substrate/Competitorn/a
Meas. Tech.ChEMBL_1362902 (CHEMBL3291944)
Ki 25000±n/a nM
Citation Lanier, MAmbrus, GCole, DCDavenport, REllery, JFosbeary, RJennings, AJKadotani, AKamada, YKamran, RMatsumoto, SMizukami, AOkubo, SOkada, KSaikatendu, KWalsh, LWu, HHixon, MS A fragment-based approach to identifying S-adenosyl-l-methionine -competitive inhibitors of catechol O-methyl transferase (COMT). J Med Chem57:5459-63 (2014) 
 
Catechol O-methyltransferase
Name:Catechol O-methyltransferase
Type:Enzyme
Mol. Mass.:30030.67
Organism:Homo sapiens (Human)
Description:P21964
Residue:271
BDBM50019332
NameBDBM50019332
Synonyms:CHEMBL3289431
TypeSmall organic molecule
Emp. Form.C7H8N4
Mol. Mass.148.1652
SMILESCn1nccc1-c1cc[nH]n1