Reaction Details
TargetCatechol O-methyltransferase
LigandBDBM50019329
Substrate/Competitorn/a
Meas. Tech.ChEMBL_1362908 (CHEMBL3291950)
Ki 1.5±n/a nM
Citation Lanier, MAmbrus, GCole, DCDavenport, REllery, JFosbeary, RJennings, AJKadotani, AKamada, YKamran, RMatsumoto, SMizukami, AOkubo, SOkada, KSaikatendu, KWalsh, LWu, HHixon, MS A fragment-based approach to identifying S-adenosyl-l-methionine -competitive inhibitors of catechol O-methyl transferase (COMT). J Med Chem57:5459-63 (2014) 
 
Catechol O-methyltransferase
Name:Catechol O-methyltransferase
Type:PROTEIN
Mol. Mass.:29482.97
Organism:Mus musculus
Description:ChEMBL_108370
Residue:265
BDBM50019329
NameBDBM50019329
Synonyms:CHEMBL1089318
TypeSmall organic molecule
Emp. Form.C15H10Cl2N4O6
Mol. Mass.413.169
SMILESCc1c(Cl)c(C)[n+]([O-])c(Cl)c1-c1noc(n1)-c1cc(O)c(O)c(c1)[N+]([O-])=O