Reaction Details
TargetCarbonic anhydrase 2
LigandBDBM50019397
Substrate/Competitorn/a
Meas. Tech.ChEMBL_1363718 (CHEMBL3293681)
IC50 3220±n/a nM
Citation Güney, MCoskun, ATopal, FDastan, AGülçin, ISupuran, CT Oxidation of cyanobenzocycloheptatrienes: Synthesis, photooxygenation reaction and carbonic anhydrase isoenzymes inhibition properties of some new benzotropone derivatives. Bioorg Med Chem22:3537-43 (2014) 
 
Carbonic anhydrase 2
Name:Carbonic anhydrase 2
Type:Enzyme
Mol. Mass.:29250.71
Organism:Homo sapiens (Human)
Description:P00918
Residue:260
BDBM50019397
NameBDBM50019397
Synonyms:CHEMBL3290058
TypeSmall organic molecule
Emp. Form.C12H7NO
Mol. Mass.181.1901
SMILESO=c1ccc2ccccc2cc1C#N