Reaction Details
TargetCarbonic anhydrase 1
LigandBDBM50019397
Substrate/Competitorn/a
Meas. Tech.ChEMBL_1363717 (CHEMBL3293680)
Ki 3660±n/a nM
Citation Güney, MCoskun, ATopal, FDastan, AGülçin, ISupuran, CT Oxidation of cyanobenzocycloheptatrienes: Synthesis, photooxygenation reaction and carbonic anhydrase isoenzymes inhibition properties of some new benzotropone derivatives. Bioorg Med Chem22:3537-43 (2014) 
 
Carbonic anhydrase 1
Name:Carbonic anhydrase 1
Type:Enzyme
Mol. Mass.:28873.37
Organism:Homo sapiens (Human)
Description:P00915
Residue:261
BDBM50019397
NameBDBM50019397
Synonyms:CHEMBL3290058
TypeSmall organic molecule
Emp. Form.C12H7NO
Mol. Mass.181.1901
SMILESO=c1ccc2ccccc2cc1C#N