Reaction Details
TargetCarbonic anhydrase 2
LigandBDBM50019399
Substrate/Competitorn/a
Meas. Tech.ChEMBL_1363718 (CHEMBL3293681)
Ki 3230±n/a nM
Citation Güney, MCoskun, ATopal, FDastan, AGülçin, ISupuran, CT Oxidation of cyanobenzocycloheptatrienes: Synthesis, photooxygenation reaction and carbonic anhydrase isoenzymes inhibition properties of some new benzotropone derivatives. Bioorg Med Chem22:3537-43 (2014) 
 
Carbonic anhydrase 2
Name:Carbonic anhydrase 2
Type:Enzyme
Mol. Mass.:29250.71
Organism:Homo sapiens (Human)
Description:P00918
Residue:260
BDBM50019399
NameBDBM50019399
Synonyms:CHEMBL3290054
TypeSmall organic molecule
Emp. Form.C12H9N
Mol. Mass.167.2066
SMILESN#CC1=CCc2ccccc2C=C1