Reaction Details
TargetCarbonic anhydrase 2
LigandBDBM50019395
Substrate/Competitorn/a
Meas. Tech.ChEMBL_1363718 (CHEMBL3293681)
Ki 2680±n/a nM
Citation Güney, MCoskun, ATopal, FDastan, AGülçin, ISupuran, CT Oxidation of cyanobenzocycloheptatrienes: Synthesis, photooxygenation reaction and carbonic anhydrase isoenzymes inhibition properties of some new benzotropone derivatives. Bioorg Med Chem22:3537-43 (2014) 
 
Carbonic anhydrase 2
Name:Carbonic anhydrase 2
Type:Enzyme
Mol. Mass.:29250.71
Organism:Homo sapiens (Human)
Description:P00918
Residue:260
BDBM50019395
NameBDBM50019395
Synonyms:CHEMBL3290057
TypeSmall organic molecule
Emp. Form.C12H7NO
Mol. Mass.181.1901
SMILESO=c1c(cccc2ccccc12)C#N