Reaction Details
TargetPlasminogen
LigandBDBM50020035
Substrate/Competitorn/a
Meas. Tech.ChEMBL_1363409 (CHEMBL3295544)
IC50 950±n/a nM
Citation Cheng, LPettersen, DOhlsson, BSchell, PKarle, MEvertsson, EPahlén, SJonforsen, MPlowright, ATBoström, JFex, TThelin, AHilgendorf, CXue, YWahlund, GLindberg, WLarsson, LOGustafsson, D Discovery of the Fibrinolysis Inhibitor AZD6564, Acting via Interference of a Protein-Protein Interaction. ACS Med Chem Lett5:538-43 (2014) 
 
Plasminogen
Name:Plasminogen
Type:Enzyme
Mol. Mass.:90579.18
Organism:Homo sapiens (Human)
Description:n/a
Residue:810
BDBM50020035
NameBDBM50020035
Synonyms:CHEMBL3287849
TypeSmall organic molecule
Emp. Form.C15H18N2O2
Mol. Mass.258.3156
SMILESO=c1cc(o[nH]1)[C@H]1CCN[C@@H](Cc2ccccc2)C1