Reaction Details
TargetPlasminogen
LigandBDBM50032954
Substrate/Competitorn/a
Meas. Tech.ChEMBL_1363410 (CHEMBL3295545)
IC50 800±n/a nM
Citation Cheng, LPettersen, DOhlsson, BSchell, PKarle, MEvertsson, EPahlén, SJonforsen, MPlowright, ATBoström, JFex, TThelin, AHilgendorf, CXue, YWahlund, GLindberg, WLarsson, LOGustafsson, D Discovery of the Fibrinolysis Inhibitor AZD6564, Acting via Interference of a Protein-Protein Interaction. ACS Med Chem Lett5:538-43 (2014) 
 
Plasminogen
Name:Plasminogen
Type:Enzyme
Mol. Mass.:90579.18
Organism:Homo sapiens (Human)
Description:n/a
Residue:810
BDBM50032954
NameBDBM50032954
Synonyms:5-(piperidin-4-yl)isoxazol-3-ol 5-Piperidin-4-yl-isoxazol-3-ol(4-PIOL) | CHEMBL311761
TypeSmall organic molecule
Emp. Form.C8H12N2O2
Mol. Mass.168.1931
SMILESO=c1cc(o[nH]1)C1CCNCC1