Reaction Details
TargetPlasminogen
LigandBDBM50020036
Substrate/Competitorn/a
Meas. Tech.ChEMBL_1363410 (CHEMBL3295545)
IC50 440±n/a nM
Citation Cheng, LPettersen, DOhlsson, BSchell, PKarle, MEvertsson, EPahlén, SJonforsen, MPlowright, ATBoström, JFex, TThelin, AHilgendorf, CXue, YWahlund, GLindberg, WLarsson, LOGustafsson, D Discovery of the Fibrinolysis Inhibitor AZD6564, Acting via Interference of a Protein-Protein Interaction. ACS Med Chem Lett5:538-43 (2014) 
 
Plasminogen
Name:Plasminogen
Type:Enzyme
Mol. Mass.:90579.18
Organism:Homo sapiens (Human)
Description:n/a
Residue:810
BDBM50020036
NameBDBM50020036
Synonyms:CHEMBL3287851
TypeSmall organic molecule
Emp. Form.C13H22N2O2
Mol. Mass.238.326
SMILESCC(C)(C)C[C@H]1C[C@H](CCN1)c1cc(=O)[nH]o1