Reaction Details
TargetPlasminogen
LigandBDBM50020043
Substrate/Competitorn/a
Meas. Tech.ChEMBL_1363410 (CHEMBL3295545)
IC50 450±n/a nM
Citation Cheng, LPettersen, DOhlsson, BSchell, PKarle, MEvertsson, EPahlén, SJonforsen, MPlowright, ATBoström, JFex, TThelin, AHilgendorf, CXue, YWahlund, GLindberg, WLarsson, LOGustafsson, D Discovery of the Fibrinolysis Inhibitor AZD6564, Acting via Interference of a Protein-Protein Interaction. ACS Med Chem Lett5:538-43 (2014) 
 
Plasminogen
Name:Plasminogen
Type:Enzyme
Mol. Mass.:90579.18
Organism:Homo sapiens (Human)
Description:n/a
Residue:810
BDBM50020043
NameBDBM50020043
Synonyms:CHEMBL3287857
TypeSmall organic molecule
Emp. Form.C15H17FN2O2
Mol. Mass.276.3061
SMILESFc1ccc(C[C@H]2C[C@H](CCN2)c2cc(=O)[nH]o2)cc1