Reaction Details
TargetDiacylglycerol O-acyltransferase 1
LigandBDBM50020050
Substrate/Competitorn/a
Meas. Tech.ChEMBL_1363771 (CHEMBL3294188)
IC50 33±n/a nM
Citation Zhou, GZorn, NTing, PAslanian, RLin, MCook, JLachowicz, JLin, ASmith, MHwa, Jvan Heek, MWalker, S Development of novel benzomorpholine class of diacylglycerol acyltransferase I inhibitors. ACS Med Chem Lett5:544-9 (2014) 
 
Diacylglycerol O-acyltransferase 1
Name:Diacylglycerol O-acyltransferase 1
Type:Protein
Mol. Mass.:55297.82
Organism:Homo sapiens (Human)
Description:O75907
Residue:488
BDBM50020050
NameBDBM50020050
Synonyms:CHEMBL3287875
TypeSmall organic molecule
Emp. Form.C31H34N2O4
Mol. Mass.498.6127
SMILESCCc1ccccc1NC(=O)N1CCOc2cc(ccc12)-c1ccc(cc1)[C@H]1CC[C@H](CC(O)=O)CC1