Reaction Details
TargetDiacylglycerol O-acyltransferase 1
LigandBDBM50020047
Substrate/Competitorn/a
Meas. Tech.ChEMBL_1363772 (CHEMBL3294189)
IC50 33±n/a nM
Citation Zhou, GZorn, NTing, PAslanian, RLin, MCook, JLachowicz, JLin, ASmith, MHwa, Jvan Heek, MWalker, S Development of novel benzomorpholine class of diacylglycerol acyltransferase I inhibitors. ACS Med Chem Lett5:544-9 (2014) 
 
Diacylglycerol O-acyltransferase 1
Name:Diacylglycerol O-acyltransferase 1
Type:Enzyme
Mol. Mass.:56810.61
Organism:Mus musculus (mouse)
Description:In this assay, recombinant mouse DGAT-1 containing an N-terminal His6-epitope tag was produced in the baculovirus expression system.
Residue:498
BDBM50020047
NameBDBM50020047
Synonyms:CHEMBL3287864
TypeSmall organic molecule
Emp. Form.C30H32N2O4
Mol. Mass.484.5861
SMILESCC1CN(C(=O)Nc2ccccc2)c2ccc(cc2O1)-c1ccc(cc1)[C@H]1CC[C@H](CC(O)=O)CC1