Reaction Details
TargetDiacylglycerol O-acyltransferase 1
LigandBDBM50020059
Substrate/Competitorn/a
Meas. Tech.ChEMBL_1363772 (CHEMBL3294189)
IC50 170±n/a nM
Citation Zhou, GZorn, NTing, PAslanian, RLin, MCook, JLachowicz, JLin, ASmith, MHwa, Jvan Heek, MWalker, S Development of novel benzomorpholine class of diacylglycerol acyltransferase I inhibitors. ACS Med Chem Lett5:544-9 (2014) 
 
Diacylglycerol O-acyltransferase 1
Name:Diacylglycerol O-acyltransferase 1
Type:Enzyme
Mol. Mass.:56810.61
Organism:Mus musculus (mouse)
Description:In this assay, recombinant mouse DGAT-1 containing an N-terminal His6-epitope tag was produced in the baculovirus expression system.
Residue:498
BDBM50020059
NameBDBM50020059
Synonyms:CHEMBL3287887
TypeSmall organic molecule
Emp. Form.C29H30N6O2
Mol. Mass.494.5875
SMILESO=C(Nc1ccccc1)N1CCOc2cc(ccc12)-c1ccc(cc1)[C@H]1CC[C@H](Cc2nnn[nH]2)CC1