Reaction Details
TargetDiacylglycerol O-acyltransferase 1
LigandBDBM50020068
Substrate/Competitorn/a
Meas. Tech.ChEMBL_1363771 (CHEMBL3294188)
IC50 1900±n/a nM
Citation Zhou, GZorn, NTing, PAslanian, RLin, MCook, JLachowicz, JLin, ASmith, MHwa, Jvan Heek, MWalker, S Development of novel benzomorpholine class of diacylglycerol acyltransferase I inhibitors. ACS Med Chem Lett5:544-9 (2014) 
 
Diacylglycerol O-acyltransferase 1
Name:Diacylglycerol O-acyltransferase 1
Type:Protein
Mol. Mass.:55297.82
Organism:Homo sapiens (Human)
Description:O75907
Residue:488
BDBM50020068
NameBDBM50020068
Synonyms:CHEMBL3287861
TypeSmall organic molecule
Emp. Form.C28H29N3O4
Mol. Mass.471.5476
SMILESOC(=O)C[C@H]1CC[C@@H](CC1)c1ccc(cc1)-c1ccc2N(CCOc2n1)C(=O)Nc1ccccc1