Reaction Details
TargetProteinase-activated receptor 1
LigandBDBM50020128
Substrate/Competitorn/a
Meas. Tech.ChEMBL_1364167 (CHEMBL3292644)
Ki 21±n/a nM
Citation Chelliah, MVEagen, KGuo, ZChackalamannil, SXia, YTsai, HGreenlee, WJAhn, HSKurowski, SBoykow, GHsieh, YChintala, M Himbacine-derived thrombin receptor antagonists: c7-spirocyclic analogues of vorapaxar. ACS Med Chem Lett5:561-5 (2014) 
 
Proteinase-activated receptor 1
Name:Proteinase-activated receptor 1
Type:Protein
Mol. Mass.:47450.07
Organism:Homo sapiens (Human)
Description:P25116
Residue:425
BDBM50020128
NameBDBM50020128
Synonyms:CHEMBL3288435
TypeSmall organic molecule
Emp. Form.C29H29F3N2O4
Mol. Mass.526.5468
SMILES[H][C@@]12C[C@]3([H])C[C@@]4(COC(=O)N4)CC[C@@]3([H])[C@H](\C=C\c3ccc(cn3)-c3cccc(c3)C(F)(F)F)[C@]1([H])[C@@H](C)OC2=O