Reaction Details
TargetTyrosine-protein kinase BTK
LigandBDBM26368
Substrate/Competitorn/a
Meas. Tech.ChEMBL_1366998 (CHEMBL3296229)
IC50 3423±n/a nM
Citation Li, XZuo, YTang, GWang, YZhou, YWang, XGuo, TXia, MDing, NPan, Z Discovery of a series of 2,5-diaminopyrimidine covalent irreversible inhibitors of Bruton's tyrosine kinase with in vivo antitumor activity. J Med Chem57:5112-28 (2014) 
 
Tyrosine-protein kinase BTK
Name:Tyrosine-protein kinase BTK
Type:Enzyme
Mol. Mass.:76289.95
Organism:Homo sapiens (Human)
Description:Q06187
Residue:659
BDBM26368
NameBDBM26368
Synonyms:3-N-(2-aminopyrimidin-5-yl)-4-methyl-1-N-[3-(trifluoromethyl)benzene]benzene-1,3-dicarboxamide | Aminopyrimidine amide, 13a
TypeSmall organic molecule
Emp. Form.C20H16F3N5O2
Mol. Mass.415.3685
SMILESCc1ccc(NC(=O)c2cccc(c2)C(F)(F)F)cc1C(=O)Nc1cnc(N)nc1