Reaction Details
TargetTyrosine-protein kinase BTK
LigandBDBM50020450
Substrate/Competitorn/a
Meas. Tech.ChEMBL_1366998 (CHEMBL3296229)
IC50 1410±n/a nM
Citation Li, XZuo, YTang, GWang, YZhou, YWang, XGuo, TXia, MDing, NPan, Z Discovery of a series of 2,5-diaminopyrimidine covalent irreversible inhibitors of Bruton's tyrosine kinase with in vivo antitumor activity. J Med Chem57:5112-28 (2014) 
 
Tyrosine-protein kinase BTK
Name:Tyrosine-protein kinase BTK
Type:Enzyme
Mol. Mass.:76289.95
Organism:Homo sapiens (Human)
Description:Q06187
Residue:659
BDBM50020450
NameBDBM50020450
Synonyms:CHEMBL3290126
TypeSmall organic molecule
Emp. Form.C32H29F3N6O4
Mol. Mass.618.6057
SMILESCCC(=O)N(C(=O)CC)c1cccc(Nc2ncc(NC(=O)c3cc(NC(=O)c4cccc(c4)C(F)(F)F)ccc3C)cn2)c1