Reaction Details
TargetTyrosine-protein kinase BTK
LigandBDBM50020452
Substrate/Competitorn/a
Meas. Tech.ChEMBL_1366998 (CHEMBL3296229)
IC50 47±n/a nM
Citation Li, XZuo, YTang, GWang, YZhou, YWang, XGuo, TXia, MDing, NPan, Z Discovery of a series of 2,5-diaminopyrimidine covalent irreversible inhibitors of Bruton's tyrosine kinase with in vivo antitumor activity. J Med Chem57:5112-28 (2014) 
 
Tyrosine-protein kinase BTK
Name:Tyrosine-protein kinase BTK
Type:Enzyme
Mol. Mass.:76289.95
Organism:Homo sapiens (Human)
Description:Q06187
Residue:659
BDBM50020452
NameBDBM50020452
Synonyms:CHEMBL3290128
TypeSmall organic molecule
Emp. Form.C25H18F4N6O2
Mol. Mass.510.443
SMILESNc1cccc(Nc2ncc(NC(=O)c3cc(NC(=O)c4cccc(c4)C(F)(F)F)ccc3F)cn2)c1