Reaction Details
TargetTyrosine-protein kinase BTK
LigandBDBM50020456
Substrate/Competitorn/a
Meas. Tech.ChEMBL_1366998 (CHEMBL3296229)
IC50 45±n/a nM
Citation Li, XZuo, YTang, GWang, YZhou, YWang, XGuo, TXia, MDing, NPan, Z Discovery of a series of 2,5-diaminopyrimidine covalent irreversible inhibitors of Bruton's tyrosine kinase with in vivo antitumor activity. J Med Chem57:5112-28 (2014) 
 
Tyrosine-protein kinase BTK
Name:Tyrosine-protein kinase BTK
Type:Enzyme
Mol. Mass.:76289.95
Organism:Homo sapiens (Human)
Description:Q06187
Residue:659
BDBM50020456
NameBDBM50020456
Synonyms:CHEMBL3290130
TypeSmall organic molecule
Emp. Form.C25H19F3N6O2
Mol. Mass.492.4526
SMILESNc1cccc(Nc2ncc(NC(=O)c3cccc(c3)C(=O)Nc3cccc(c3)C(F)(F)F)cn2)c1