Reaction Details
TargetTyrosine-protein kinase BTK
LigandBDBM50020457
Substrate/Competitorn/a
Meas. Tech.ChEMBL_1366998 (CHEMBL3296229)
IC50 63±n/a nM
Citation Li, XZuo, YTang, GWang, YZhou, YWang, XGuo, TXia, MDing, NPan, Z Discovery of a series of 2,5-diaminopyrimidine covalent irreversible inhibitors of Bruton's tyrosine kinase with in vivo antitumor activity. J Med Chem57:5112-28 (2014) 
 
Tyrosine-protein kinase BTK
Name:Tyrosine-protein kinase BTK
Type:Enzyme
Mol. Mass.:76289.95
Organism:Homo sapiens (Human)
Description:Q06187
Residue:659
BDBM50020457
NameBDBM50020457
Synonyms:CHEMBL3290131
TypeSmall organic molecule
Emp. Form.C26H22F3N7O2
Mol. Mass.521.4938
SMILESCc1ccc(NC(=O)Nc2cccc(c2)C(F)(F)F)cc1C(=O)Nc1cnc(Nc2cccc(N)c2)nc1