Reaction Details
TargetTyrosine-protein kinase BTK
LigandBDBM50020470
Substrate/Competitorn/a
Meas. Tech.ChEMBL_1366998 (CHEMBL3296229)
IC50 18±n/a nM
Citation Li, XZuo, YTang, GWang, YZhou, YWang, XGuo, TXia, MDing, NPan, Z Discovery of a series of 2,5-diaminopyrimidine covalent irreversible inhibitors of Bruton's tyrosine kinase with in vivo antitumor activity. J Med Chem57:5112-28 (2014) 
 
Tyrosine-protein kinase BTK
Name:Tyrosine-protein kinase BTK
Type:Enzyme
Mol. Mass.:76289.95
Organism:Homo sapiens (Human)
Description:Q06187
Residue:659
BDBM50020470
NameBDBM50020470
Synonyms:CHEMBL3290137
TypeSmall organic molecule
Emp. Form.C26H20ClF3N6O2
Mol. Mass.540.924
SMILESCc1ccc(NC(=O)c2cc(Cl)cc(c2)C(F)(F)F)cc1C(=O)Nc1cnc(Nc2cccc(N)c2)nc1