Reaction Details
TargetReceptor tyrosine-protein kinase erbB-4
LigandBDBM50020476
Substrate/Competitorn/a
Meas. Tech.ChEMBL_1361208 (CHEMBL3292440)
IC50 3.3±n/a nM
Citation Li, XZuo, YTang, GWang, YZhou, YWang, XGuo, TXia, MDing, NPan, Z Discovery of a series of 2,5-diaminopyrimidine covalent irreversible inhibitors of Bruton's tyrosine kinase with in vivo antitumor activity. J Med Chem57:5112-28 (2014) 
 
Receptor tyrosine-protein kinase erbB-4
Name:Receptor tyrosine-protein kinase erbB-4
Type:Protein
Mol. Mass.:146803.56
Organism:Homo sapiens (Human)
Description:Q15303
Residue:1308
BDBM50020476
NameBDBM50020476
Synonyms:CHEMBL3290148
TypeSmall organic molecule
Emp. Form.C31H26F3N7O4
Mol. Mass.617.5778
SMILESCc1ccc(NC(=O)c2cccc(c2)C(F)(F)F)cc1C(=O)Nc1cnc(Nc2cccc(NC(=O)CNC(=O)C=C)c2)nc1