Reaction Details
TargetTyrosine-protein kinase JAK3
LigandBDBM50020471
Substrate/Competitorn/a
Meas. Tech.ChEMBL_1361210 (CHEMBL3292442)
IC50 2680±n/a nM
Citation Li, XZuo, YTang, GWang, YZhou, YWang, XGuo, TXia, MDing, NPan, Z Discovery of a series of 2,5-diaminopyrimidine covalent irreversible inhibitors of Bruton's tyrosine kinase with in vivo antitumor activity. J Med Chem57:5112-28 (2014) 
 
Tyrosine-protein kinase JAK3
Name:Tyrosine-protein kinase JAK3
Type:Protein
Mol. Mass.:125111.08
Organism:Homo sapiens (Human)
Description:P52333
Residue:1124
BDBM50020471
NameBDBM50020471
Synonyms:CHEMBL3290142
TypeSmall organic molecule
Emp. Form.C29H23F3N6O3
Mol. Mass.560.5265
SMILESCc1ccc(NC(=O)c2cccc(c2)C(F)(F)F)cc1C(=O)Nc1cnc(Nc2cccc(NC(=O)C=C)c2)nc1