Reaction Details
TargetTyrosine-protein kinase Tec
LigandBDBM50020471
Substrate/Competitorn/a
Meas. Tech.ChEMBL_1361212 (CHEMBL3292444)
IC50 8.2±n/a nM
Citation Li, XZuo, YTang, GWang, YZhou, YWang, XGuo, TXia, MDing, NPan, Z Discovery of a series of 2,5-diaminopyrimidine covalent irreversible inhibitors of Bruton's tyrosine kinase with in vivo antitumor activity. J Med Chem57:5112-28 (2014) 
 
Tyrosine-protein kinase Tec
Name:Tyrosine-protein kinase Tec
Type:Protein
Mol. Mass.:73597.00
Organism:Homo sapiens (Human)
Description:n/a
Residue:631
BDBM50020471
NameBDBM50020471
Synonyms:CHEMBL3290142
TypeSmall organic molecule
Emp. Form.C29H23F3N6O3
Mol. Mass.560.5265
SMILESCc1ccc(NC(=O)c2cccc(c2)C(F)(F)F)cc1C(=O)Nc1cnc(Nc2cccc(NC(=O)C=C)c2)nc1