Reaction Details
TargetTyrosine-protein kinase Tec
LigandBDBM50020476
Substrate/Competitorn/a
Meas. Tech.ChEMBL_1361212 (CHEMBL3292444)
IC50 6.3±n/a nM
Citation Li, XZuo, YTang, GWang, YZhou, YWang, XGuo, TXia, MDing, NPan, Z Discovery of a series of 2,5-diaminopyrimidine covalent irreversible inhibitors of Bruton's tyrosine kinase with in vivo antitumor activity. J Med Chem57:5112-28 (2014) 
 
Tyrosine-protein kinase Tec
Name:Tyrosine-protein kinase Tec
Type:Protein
Mol. Mass.:73597.00
Organism:Homo sapiens (Human)
Description:n/a
Residue:631
BDBM50020476
NameBDBM50020476
Synonyms:CHEMBL3290148
TypeSmall organic molecule
Emp. Form.C31H26F3N7O4
Mol. Mass.617.5778
SMILESCc1ccc(NC(=O)c2cccc(c2)C(F)(F)F)cc1C(=O)Nc1cnc(Nc2cccc(NC(=O)CNC(=O)C=C)c2)nc1