Reaction Details
TargetTyrosine-protein kinase BTK
LigandBDBM50020483
Substrate/Competitorn/a
Meas. Tech.ChEMBL_1366998 (CHEMBL3296229)
IC50 39±n/a nM
Citation Li, XZuo, YTang, GWang, YZhou, YWang, XGuo, TXia, MDing, NPan, Z Discovery of a series of 2,5-diaminopyrimidine covalent irreversible inhibitors of Bruton's tyrosine kinase with in vivo antitumor activity. J Med Chem57:5112-28 (2014) 
 
Tyrosine-protein kinase BTK
Name:Tyrosine-protein kinase BTK
Type:Enzyme
Mol. Mass.:76289.95
Organism:Homo sapiens (Human)
Description:Q06187
Residue:659
BDBM50020483
NameBDBM50020483
Synonyms:CHEMBL3290141
TypeSmall organic molecule
Emp. Form.C29H24N6O2
Mol. Mass.488.5399
SMILESCc1ccc(NC(=O)c2ccc3ccccc3c2)cc1C(=O)Nc1cnc(Nc2cccc(N)c2)nc1