Reaction Details
TargetTyrosine-protein kinase Lck
LigandBDBM50020440
Substrate/Competitorn/a
Meas. Tech.ChEMBL_1366999 (CHEMBL3296230)
IC50 142±n/a nM
Citation Li, XZuo, YTang, GWang, YZhou, YWang, XGuo, TXia, MDing, NPan, Z Discovery of a series of 2,5-diaminopyrimidine covalent irreversible inhibitors of Bruton's tyrosine kinase with in vivo antitumor activity. J Med Chem57:5112-28 (2014) 
 
Tyrosine-protein kinase Lck
Name:Tyrosine-protein kinase Lck
Type:n/a
Mol. Mass.:57987.83
Organism:Homo sapiens (Human)
Description:P06239
Residue:509
BDBM50020440
NameBDBM50020440
Synonyms:CHEMBL3290116
TypeSmall organic molecule
Emp. Form.C22H20F3N5O2
Mol. Mass.443.4217
SMILESCCNc1ncc(NC(=O)c2cc(NC(=O)c3cccc(c3)C(F)(F)F)ccc2C)cn1