Reaction Details
TargetTyrosine-protein kinase Lck
LigandBDBM50020443
Substrate/Competitorn/a
Meas. Tech.ChEMBL_1366999 (CHEMBL3296230)
IC50 16±n/a nM
Citation Li, XZuo, YTang, GWang, YZhou, YWang, XGuo, TXia, MDing, NPan, Z Discovery of a series of 2,5-diaminopyrimidine covalent irreversible inhibitors of Bruton's tyrosine kinase with in vivo antitumor activity. J Med Chem57:5112-28 (2014) 
 
Tyrosine-protein kinase Lck
Name:Tyrosine-protein kinase Lck
Type:n/a
Mol. Mass.:57987.83
Organism:Homo sapiens (Human)
Description:P06239
Residue:509
BDBM50020443
NameBDBM50020443
Synonyms:CHEMBL3290119
TypeSmall organic molecule
Emp. Form.C27H19F6N5O2
Mol. Mass.559.4625
SMILESCc1ccc(NC(=O)c2cccc(c2)C(F)(F)F)cc1C(=O)Nc1cnc(Nc2cccc(c2)C(F)(F)F)nc1