Reaction Details
TargetTyrosine-protein kinase Lck
LigandBDBM50020445
Substrate/Competitorn/a
Meas. Tech.ChEMBL_1366999 (CHEMBL3296230)
IC50 4.0±n/a nM
Citation Li, XZuo, YTang, GWang, YZhou, YWang, XGuo, TXia, MDing, NPan, Z Discovery of a series of 2,5-diaminopyrimidine covalent irreversible inhibitors of Bruton's tyrosine kinase with in vivo antitumor activity. J Med Chem57:5112-28 (2014) 
 
Tyrosine-protein kinase Lck
Name:Tyrosine-protein kinase Lck
Type:n/a
Mol. Mass.:57987.83
Organism:Homo sapiens (Human)
Description:P06239
Residue:509
BDBM50020445
NameBDBM50020445
Synonyms:CHEMBL3290121
TypeSmall organic molecule
Emp. Form.C26H19F4N5O2
Mol. Mass.509.455
SMILESCc1ccc(NC(=O)c2cccc(c2)C(F)(F)F)cc1C(=O)Nc1cnc(Nc2cccc(F)c2)nc1