Reaction Details
TargetCannabinoid receptor 1
LigandBDBM50200169
Substrate/Competitorn/a
Meas. Tech.ChEMBL_1361899 (CHEMBL3293295)
Ki 363±n/a nM
Citation Pinna, GLoriga, GLazzari, PRuiu, SFalzoi, MFrau, SPau, AMurineddu, GAsproni, BPinna, GA Tricyclic pyrazoles. Part 6. Benzofuro[3,2-c]pyrazole: a versatile architecture for CB2 selective ligands. Eur J Med Chem82:281-92 (2014) 
 
Cannabinoid receptor 1
Name:Cannabinoid receptor 1
Type:G Protein-Coupled Receptor (GPCR)
Mol. Mass.:52868.96
Organism:Homo sapiens (Human)
Description:P21554
Residue:472
BDBM50200169
NameBDBM50200169
Synonyms:6-methyl-1-(2',4'-dichlorophenyl)-N-piperidin-1-yl-1,4-dihydroindeno[1,2-c]pyrazole-3-carboxamide | CHEMBL216276
TypeSmall organic molecule
Emp. Form.C23H22Cl2N4O
Mol. Mass.441.353
SMILESCc1ccc-2c(Cc3c(nn(c-23)-c2ccc(Cl)cc2Cl)C(=O)NN2CCCCC2)c1