Reaction Details
TargetCannabinoid receptor 1
LigandBDBM50020594
Substrate/Competitorn/a
Meas. Tech.ChEMBL_1361904 (CHEMBL3293300)
Ki 1247±n/a nM
Citation Pinna, GLoriga, GLazzari, PRuiu, SFalzoi, MFrau, SPau, AMurineddu, GAsproni, BPinna, GA Tricyclic pyrazoles. Part 6. Benzofuro[3,2-c]pyrazole: a versatile architecture for CB2 selective ligands. Eur J Med Chem82:281-92 (2014) 
 
Cannabinoid receptor 1
Name:Cannabinoid receptor 1
Type:Enzyme
Mol. Mass.:52842.52
Organism:Mus musculus (Mouse)
Description:P47746
Residue:473
BDBM50020594
NameBDBM50020594
Synonyms:CHEMBL3290444
TypeSmall organic molecule
Emp. Form.C23H21Cl2N3O2
Mol. Mass.442.338
SMILESCc1ccc2c(c1)oc1c(nn(-c3ccc(Cl)cc3Cl)c21)C(=O)NC1CCCCC1