Reaction Details
TargetCannabinoid receptor 1
LigandBDBM50020598
Substrate/Competitorn/a
Meas. Tech.ChEMBL_1361904 (CHEMBL3293300)
Ki 2398±n/a nM
Citation Pinna, GLoriga, GLazzari, PRuiu, SFalzoi, MFrau, SPau, AMurineddu, GAsproni, BPinna, GA Tricyclic pyrazoles. Part 6. Benzofuro[3,2-c]pyrazole: a versatile architecture for CB2 selective ligands. Eur J Med Chem82:281-92 (2014) 
 
Cannabinoid receptor 1
Name:Cannabinoid receptor 1
Type:Enzyme
Mol. Mass.:52842.52
Organism:Mus musculus (Mouse)
Description:P47746
Residue:473
BDBM50020598
NameBDBM50020598
Synonyms:CHEMBL3290448
TypeSmall organic molecule
Emp. Form.C27H27Cl2N3O2
Mol. Mass.496.428
SMILESC[C@@H]1C2CC(C[C@H]1NC(=O)c1nn(-c3ccc(Cl)cc3Cl)c3c1oc1cc(C)ccc31)C2(C)C