Reaction Details
TargetPoly [ADP-ribose] polymerase 1
LigandBDBM50020621
Substrate/Competitorn/a
Meas. Tech.ChEMBL_1361917 (CHEMBL3293313)
IC50 3620±n/a nM
Citation Patel, MRBhatt, ASteffen, JDChergui, AMurai, JPommier, YPascal, JMTrombetta, LDFronczek, FRTalele, TT Discovery and structure-activity relationship of novel 2,3-dihydrobenzofuran-7-carboxamide and 2,3-dihydrobenzofuran-3(2H)-one-7-carboxamide derivatives as poly(ADP-ribose)polymerase-1 inhibitors. J Med Chem57:5579-601 (2014) 
 
Poly [ADP-ribose] polymerase 1
Name:Poly [ADP-ribose] polymerase 1
Type:n/a
Mol. Mass.:113114.22
Organism:Homo sapiens (Human)
Description:P09874
Residue:1014
BDBM50020621
NameBDBM50020621
Synonyms:CHEMBL3290471
TypeSmall organic molecule
Emp. Form.C17H13NO5
Mol. Mass.311.2888
SMILESCOc1cc(\C=C2/Oc3c(cccc3C(N)=O)C2=O)ccc1O