Reaction Details
TargetDNA polymerase beta
LigandBDBM50020676
Substrate/Competitorn/a
Meas. Tech.ChEMBL_1361926 (CHEMBL3293530)
IC50 30800±n/a nM
Citation Le, DHTakenaka, YHamada, NMizushina, YTanahashi, T Polyketides from the cultured lichen mycobiont of a Vietnamese Pyrenula sp. J Nat Prod77:1404-12 (2014) 
 
DNA polymerase beta
Name:DNA polymerase beta
Type:PROTEIN
Mol. Mass.:38334.34
Organism:Rattus norvegicus
Description:ChEMBL_1361926
Residue:335
BDBM50020676
NameBDBM50020676
Synonyms:CHEBI:41846 | CHEMBL566812
TypeSmall organic molecule
Emp. Form.C10H17N2O13P3
Mol. Mass.466.1689
SMILESCc1cn([C@H]2CC[C@@H](COP(O)(=O)OP(O)(=O)OP(O)(O)=O)O2)c(=O)[nH]c1=O