Reaction Details
TargetMatrix protein 2
LigandBDBM50020755
Substrate/Competitorn/a
Meas. Tech.ChEMBL_1364624 (CHEMBL3291757)
IC50 1240±n/a nM
Citation Rey-Carrizo, MBarniol-Xicota, MMa, CFrigolé-Vivas, MTorres, ENaesens, LLlabrés, SJuárez-Jiménez, JLuque, FJDeGrado, WFLamb, RAPinto, LHVázquez, S Easily accessible polycyclic amines that inhibit the wild-type and amantadine-resistant mutants of the M2 channel of influenza A virus. J Med Chem57:5738-47 (2014) 
 
Matrix protein 2
Name:Matrix protein 2
Type:PROTEIN
Mol. Mass.:11180.06
Organism:Influenza A virus (A/Udorn/307/1972(H3N2))
Description:ChEMBL_22
Residue:97
BDBM50020755
NameBDBM50020755
Synonyms:CHEMBL3286977
TypeSmall organic molecule
Emp. Form.C12H20ClN
Mol. Mass.213.747
SMILESCl.C1CC2C1C1CCC2C2CNCC12