Reaction Details
TargetD(2) dopamine receptor
LigandBDBM50021769
Substrate/Competitorn/a
Meas. Tech.ChEMBL_1369057 (CHEMBL3300170)
EC50 88±n/a nM
Citation Szabo, MKlein Herenbrink, CChristopoulos, ALane, JRCapuano, B Structure-activity relationships of privileged structures lead to the discovery of novel biased ligands at the dopamine D2 receptor. J Med Chem57:4924-39 (2014) 
 
D(2) dopamine receptor
Name:D(2) dopamine receptor
Type:Cell-surface receptors
Mol. Mass.:50647.10
Organism:Homo sapiens (Human)
Description:P14416
Residue:443
BDBM50021769
NameBDBM50021769
Synonyms:CHEMBL3298830
TypeSmall organic molecule
Emp. Form.C25H30Cl3N5O2S
Mol. Mass.570.962
SMILESCOc1nc2sc(C(=O)NCCCCCN3CCN(CC3)c3cccc(Cl)c3Cl)c(N)c2c(C)c1Cl