Reaction Details
TargetD(2) dopamine receptor
LigandBDBM50021817
Substrate/Competitorn/a
Meas. Tech.ChEMBL_1369049 (CHEMBL3300162)
Ki 6.3±n/a nM
Citation Szabo, MKlein Herenbrink, CChristopoulos, ALane, JRCapuano, B Structure-activity relationships of privileged structures lead to the discovery of novel biased ligands at the dopamine D2 receptor. J Med Chem57:4924-39 (2014) 
 
D(2) dopamine receptor
Name:D(2) dopamine receptor
Type:Cell-surface receptors
Mol. Mass.:50647.10
Organism:Homo sapiens (Human)
Description:P14416
Residue:443
BDBM50021817
NameBDBM50021817
Synonyms:CHEMBL3298826
TypeSmall organic molecule
Emp. Form.C25H32ClN5O3S
Mol. Mass.518.071
SMILESCOc1ccccc1N1CCN(CCCCNC(=O)c2sc3nc(OC)c(Cl)c(C)c3c2N)CC1