Reaction Details
TargetAlpha-1A adrenergic receptor
LigandBDBM50023189
Substrate/Competitorn/a
Meas. Tech.ChEMBL_1368299 (CHEMBL3299604)
Ki 0.933254±n/a nM
Citation Romeo, GSalerno, LPittalą, VModica, MNSiracusa, MAMateria, LBuccioni, MMarucci, GMinneman, KP High affinity ligands and potent antagonists for thea1D-adrenergic receptor. Novel 3,8-disubstituted [1]benzothieno[3,2-d]pyrimidine derivatives. Eur J Med Chem83:419-32 (2014) 
 
Alpha-1A adrenergic receptor
Name:Alpha-1A adrenergic receptor
Type:Cell-surface receptors
Mol. Mass.:51511.67
Organism:Homo sapiens (Human)
Description:P35348
Residue:466
BDBM50023189
NameBDBM50023189
Synonyms:CHEMBL3297829
TypeSmall organic molecule
Emp. Form.C36H40N6O5S
Mol. Mass.668.805
SMILESCOc1ccccc1N1CCN(CCn2c(=O)[nH]c3c4cc(NC(=O)CCCC(=O)N(C)Cc5ccccc5)ccc4sc3c2=O)CC1