Reaction Details
TargetGenome polyprotein
LigandBDBM50023580
Substrate/Competitorn/a
Meas. Tech.ChEMBL_1452511 (CHEMBL3362860)
IC50 2400±n/a nM
Citation Parsy, CAlexandre, FRBrandt, GCaillet, CCappelle, SChaves, DConvard, TDerock, MGloux, DGriffon, YLallos, LLeroy, FLiuzzi, MLoi, AGMoulat, LMusiu, CRahali, HRoques, VSeifer, MStandring, DSurleraux, D Structure-based design of a novel series of azetidine inhibitors of the hepatitis C virus NS3/4A serine protease. Bioorg Med Chem Lett24:4444-9 (2014) 
 
Genome polyprotein
Name:Genome polyprotein
Synonyms:Nonstructural protein NS3-4A
Type:PROTEIN
Mol. Mass.:71633.49
Organism:Hepatitis C virus
Description:ChEMBL_109716
Residue:674
BDBM50023580
NameBDBM50023580
Synonyms:CHEMBL3326536
TypeSmall organic molecule
Emp. Form.C36H41N5O7S
Mol. Mass.687.805
SMILES[H][C@]12C[C@@]1(NC(=O)[C@]1([H])C[C@@H](COc3cc(nc4cc(OC)ccc34)-c3ccccc3)N1C(=O)N(C)CCCC\C=C/2)C(=O)NS(=O)(=O)C1CC1